Reaction Details
TargetTGF-beta receptor type-1
LigandBDBM50293519
Substrate/Competitorn/a
Meas. Tech.ChEMBL_570590 (CHEMBL1030214)
IC50 40±n/a nM
Citation Gellibert, FFouchet, MHNguyen, VLWang, RKrysa, Gde Gouville, ACHuet, SDodic, N Design of novel quinazoline derivatives and related analogues as potent and selective ALK5 inhibitors. Bioorg Med Chem Lett19:2277-81 (2009) 
 
TGF-beta receptor type-1
Name:TGF-beta receptor type-1
Type:enzyme
Mol. Mass.:55968.24
Organism:Homo sapiens (Human)
Description:P36897
Residue:503
BDBM50293519
NameBDBM50293519
Synonyms:2-(6-methylpyridin-2-yl)-N-(pyrimidin-4-yl)quinazolin-4-amine | CHEMBL571452
TypeSmall organic molecule
Emp. Form.C18H14N6
Mol. Mass.314.344
SMILESCc1cccc(n1)-c1nc(Nc2ccncn2)c2ccccc2n1