Reaction Details
TargetTrypanothione reductase
LigandBDBM77970
Substrate/Competitorn/a
Meas. Tech.ChEMBL_571030 (CHEMBL1024386)
Ki 6500±n/a nM
Citation Cavalli, ALizzi, FBongarzone, SBrun, RLuise Krauth-Siegel, RBolognesi, ML Privileged structure-guided synthesis of quinazoline derivatives as inhibitors of trypanothione reductase. Bioorg Med Chem Lett19:3031-5 (2009) 
 
Trypanothione reductase
Name:Trypanothione reductase
Type:Homodimer; oxidoreductase
Mol. Mass.:53868.26
Organism:Trypanosoma cruzi
Description:n/a
Residue:492
BDBM77970
NameBDBM77970
Synonyms:3-(2-chloranyl-5,6-dihydrobenzo[b][1]benzazepin-11-yl)-N,N-dimethyl-propan-1-amine;hydrochloride 3-(2-chloro-5,6-dihydrobenzo[b][1]benzazepin-11-yl)-N,N-dimethylpropan-1-amine;hydrochloride CHLORIMIPRAMINE CLOMIPRAMINE HYDROCHLORIDE MLS000028511 cid_68539 | med.21724, Compound Clomipramine
TypeSmall organic molecule
Emp. Form.C19H23ClN2
Mol. Mass.314.852
SMILESCN(C)CCCN1c2ccccc2CCc2ccc(Cl)cc12