Reaction Details
TargetAurora kinase B
LigandBDBM50293691
Substrate/Competitorn/a
Meas. Tech.ChEMBL_571640 (CHEMBL1031295)
Ki 207±n/a nM
Citation Bebbington, DBinch, HCharrier, JDEveritt, SFraysse, DGolec, JKay, DKnegtel, RMak, CMazzei, FMiller, AMortimore, MO'Donnell, MPatel, SPierard, FPinder, JPollard, JRamaya, SRobinson, DRutherford, AStudley, JWestcott, J The discovery of the potent aurora inhibitor MK-0457 (VX-680). Bioorg Med Chem Lett19:3586-92 (2009) 
 
Aurora kinase B
Name:Aurora kinase B
Type:Protein
Mol. Mass.:39327.72
Organism:Homo sapiens (Human)
Description:Q96GD4
Residue:344
BDBM50293691
NameBDBM50293691
Synonyms:CHEMBL549469 | N-(4-(4-(5-methyl-1H-pyrazol-3-ylamino)pyrimidin-2-ylthio)phenyl)acetamide
TypeSmall organic molecule
Emp. Form.C16H16N6OS
Mol. Mass.340.403
SMILESCC(=O)Nc1ccc(Sc2nccc(Nc3cc(C)n[nH]3)n2)cc1