Reaction Details
TargetAurora kinase B
LigandBDBM50293682
Substrate/Competitorn/a
Meas. Tech.ChEMBL_571640 (CHEMBL1031295)
Ki>40±n/a nM
Citation Bebbington, DBinch, HCharrier, JDEveritt, SFraysse, DGolec, JKay, DKnegtel, RMak, CMazzei, FMiller, AMortimore, MO'Donnell, MPatel, SPierard, FPinder, JPollard, JRamaya, SRobinson, DRutherford, AStudley, JWestcott, J The discovery of the potent aurora inhibitor MK-0457 (VX-680). Bioorg Med Chem Lett19:3586-92 (2009) 
 
Aurora kinase B
Name:Aurora kinase B
Type:Protein
Mol. Mass.:39327.72
Organism:Homo sapiens (Human)
Description:Q96GD4
Residue:344
BDBM50293682
NameBDBM50293682
Synonyms:2-(3,4-dichlorophenylthio)-N-(5-methyl-1H-pyrazol-3-yl)quinazolin-4-amine | CHEMBL552385
TypeSmall organic molecule
Emp. Form.C18H13Cl2N5S
Mol. Mass.402.3
SMILESCc1cc(Nc2nc(Sc3ccc(Cl)c(Cl)c3)nc3ccccc23)[nH]n1