Reaction Details
TargetAurora kinase B
LigandBDBM50293687
Substrate/Competitorn/a
Meas. Tech.ChEMBL_571640 (CHEMBL1031295)
Ki 230±n/a nM
Citation Bebbington, DBinch, HCharrier, JDEveritt, SFraysse, DGolec, JKay, DKnegtel, RMak, CMazzei, FMiller, AMortimore, MO'Donnell, MPatel, SPierard, FPinder, JPollard, JRamaya, SRobinson, DRutherford, AStudley, JWestcott, J The discovery of the potent aurora inhibitor MK-0457 (VX-680). Bioorg Med Chem Lett19:3586-92 (2009) 
 
Aurora kinase B
Name:Aurora kinase B
Type:Protein
Mol. Mass.:39327.72
Organism:Homo sapiens (Human)
Description:Q96GD4
Residue:344
BDBM50293687
NameBDBM50293687
Synonyms:CHEMBL552033 | N-(4-(4-(5-methyl-1H-pyrazol-3-ylamino)quinazolin-2-ylthio)phenyl)methanesulfonamide
TypeSmall organic molecule
Emp. Form.C19H18N6O2S2
Mol. Mass.426.515
SMILESCc1cc(Nc2nc(Sc3ccc(NS(C)(=O)=O)cc3)nc3ccccc23)[nH]n1