Reaction Details
TargetAurora kinase B
LigandBDBM50277679
Substrate/Competitorn/a
Meas. Tech.ChEMBL_571655 (CHEMBL1031310)
Ki 0.800000±n/a nM
Citation Bebbington, DBinch, HCharrier, JDEveritt, SFraysse, DGolec, JKay, DKnegtel, RMak, CMazzei, FMiller, AMortimore, MO'Donnell, MPatel, SPierard, FPinder, JPollard, JRamaya, SRobinson, DRutherford, AStudley, JWestcott, J The discovery of the potent aurora inhibitor MK-0457 (VX-680). Bioorg Med Chem Lett19:3586-92 (2009) 
 
Aurora kinase B
Name:Aurora kinase B
Type:Protein
Mol. Mass.:39327.72
Organism:Homo sapiens (Human)
Description:Q96GD4
Residue:344
BDBM50277679
NameBDBM50277679
Synonyms:CHEMBL484006 | N-(4-(4-(4-tert-butylpiperazin-1-yl)-6-(5-methyl-1H-pyrazol-3-ylamino)pyrimidin-2-ylthio)phenyl)propionamide
TypeSmall organic molecule
Emp. Form.C25H34N8OS
Mol. Mass.494.655
SMILESCCC(=O)Nc1ccc(Sc2nc(Nc3cc(C)n[nH]3)cc(n2)N2CCN(CC2)C(C)(C)C)cc1