Reaction Details
TargetProto-oncogene tyrosine-protein kinase Src
LigandBDBM50293671
Substrate/Competitorn/a
Meas. Tech.ChEMBL_571642 (CHEMBL1031297)
Ki 1735±n/a nM
Citation Bebbington, DBinch, HCharrier, JDEveritt, SFraysse, DGolec, JKay, DKnegtel, RMak, CMazzei, FMiller, AMortimore, MO'Donnell, MPatel, SPierard, FPinder, JPollard, JRamaya, SRobinson, DRutherford, AStudley, JWestcott, J The discovery of the potent aurora inhibitor MK-0457 (VX-680). Bioorg Med Chem Lett19:3586-92 (2009) 
 
Proto-oncogene tyrosine-protein kinase Src
Name:Proto-oncogene tyrosine-protein kinase Src
Type:Protein
Mol. Mass.:59838.60
Organism:Homo sapiens (Human)
Description:P12931
Residue:536
BDBM50293671
NameBDBM50293671
Synonyms:CHEMBL561421 | N-(4-(4-(5-cyclopropyl-1H-pyrazol-3-ylamino)quinazolin-2-ylthio)phenyl)acetamide
TypeSmall organic molecule
Emp. Form.C22H20N6OS
Mol. Mass.416.499
SMILESCC(=O)Nc1ccc(Sc2nc(Nc3cc(n[nH]3)C3CC3)c3ccccc3n2)cc1