Reaction Details
TargetGlycogen synthase kinase-3 beta
LigandBDBM50293675
Substrate/Competitorn/a
Meas. Tech.ChEMBL_571643 (CHEMBL1031298)
Ki 171±n/a nM
Citation Bebbington, DBinch, HCharrier, JDEveritt, SFraysse, DGolec, JKay, DKnegtel, RMak, CMazzei, FMiller, AMortimore, MO'Donnell, MPatel, SPierard, FPinder, JPollard, JRamaya, SRobinson, DRutherford, AStudley, JWestcott, J The discovery of the potent aurora inhibitor MK-0457 (VX-680). Bioorg Med Chem Lett19:3586-92 (2009) 
 
Glycogen synthase kinase-3 beta
Name:Glycogen synthase kinase-3 beta
Type:Enzyme
Mol. Mass.:46756.38
Organism:Homo sapiens (Human)
Description:P49841
Residue:420
BDBM50293675
NameBDBM50293675
Synonyms:CHEMBL549322 | N-(5-methyl-1H-pyrazol-3-yl)-2-(phenylthio)quinazolin-4-amine
TypeSmall organic molecule
Emp. Form.C18H15N5S
Mol. Mass.333.41
SMILESCc1cc(Nc2nc(Sc3ccccc3)nc3ccccc23)[nH]n1