Reaction Details
TargetGlycogen synthase kinase-3 beta
LigandBDBM50293685
Substrate/Competitorn/a
Meas. Tech.ChEMBL_571643 (CHEMBL1031298)
Ki 1168±n/a nM
Citation Bebbington, DBinch, HCharrier, JDEveritt, SFraysse, DGolec, JKay, DKnegtel, RMak, CMazzei, FMiller, AMortimore, MO'Donnell, MPatel, SPierard, FPinder, JPollard, JRamaya, SRobinson, DRutherford, AStudley, JWestcott, J The discovery of the potent aurora inhibitor MK-0457 (VX-680). Bioorg Med Chem Lett19:3586-92 (2009) 
 
Glycogen synthase kinase-3 beta
Name:Glycogen synthase kinase-3 beta
Type:Enzyme
Mol. Mass.:46756.38
Organism:Homo sapiens (Human)
Description:P49841
Residue:420
BDBM50293685
NameBDBM50293685
Synonyms:2-(3,4-dimethoxyphenylthio)-N-(5-methyl-1H-pyrazol-3-yl)quinazolin-4-amine | CHEMBL564290
TypeSmall organic molecule
Emp. Form.C20H19N5O2S
Mol. Mass.393.462
SMILESCOc1ccc(Sc2nc(Nc3cc(C)n[nH]3)c3ccccc3n2)cc1OC