Reaction Details
TargetGlycogen synthase kinase-3 beta
LigandBDBM50293686
Substrate/Competitorn/a
Meas. Tech.ChEMBL_571643 (CHEMBL1031298)
Ki>150±n/a nM
Citation Bebbington, DBinch, HCharrier, JDEveritt, SFraysse, DGolec, JKay, DKnegtel, RMak, CMazzei, FMiller, AMortimore, MO'Donnell, MPatel, SPierard, FPinder, JPollard, JRamaya, SRobinson, DRutherford, AStudley, JWestcott, J The discovery of the potent aurora inhibitor MK-0457 (VX-680). Bioorg Med Chem Lett19:3586-92 (2009) 
 
Glycogen synthase kinase-3 beta
Name:Glycogen synthase kinase-3 beta
Type:Enzyme
Mol. Mass.:46756.38
Organism:Homo sapiens (Human)
Description:P49841
Residue:420
BDBM50293686
NameBDBM50293686
Synonyms:CHEMBL559900 | N-(5-methyl-1H-pyrazol-3-yl)-2-(naphthalen-2-ylthio)quinazolin-4-amine
TypeSmall organic molecule
Emp. Form.C22H17N5S
Mol. Mass.383.469
SMILESCc1cc(Nc2nc(Sc3ccc4ccccc4c3)nc3ccccc23)[nH]n1