Reaction Details
TargetGlycogen synthase kinase-3 beta
LigandBDBM50293688
Substrate/Competitorn/a
Meas. Tech.ChEMBL_571643 (CHEMBL1031298)
Ki>4000±n/a nM
Citation Bebbington, DBinch, HCharrier, JDEveritt, SFraysse, DGolec, JKay, DKnegtel, RMak, CMazzei, FMiller, AMortimore, MO'Donnell, MPatel, SPierard, FPinder, JPollard, JRamaya, SRobinson, DRutherford, AStudley, JWestcott, J The discovery of the potent aurora inhibitor MK-0457 (VX-680). Bioorg Med Chem Lett19:3586-92 (2009) 
 
Glycogen synthase kinase-3 beta
Name:Glycogen synthase kinase-3 beta
Type:Enzyme
Mol. Mass.:46756.38
Organism:Homo sapiens (Human)
Description:P49841
Residue:420
BDBM50293688
NameBDBM50293688
Synonyms:CHEMBL556460 | tert-butyl 4-(4-(5-methyl-1H-pyrazol-3-ylamino)quinazolin-2-ylthio)phenylcarbamate
TypeSmall organic molecule
Emp. Form.C23H24N6O2S
Mol. Mass.448.541
SMILESCc1cc(Nc2nc(Sc3ccc(NC(=O)OC(C)(C)C)cc3)nc3ccccc23)[nH]n1