Reaction Details
TargetAurora kinase A
LigandBDBM50293692
Substrate/Competitorn/a
Meas. Tech.ChEMBL_571639 (CHEMBL1031294)
Ki 18±n/a nM
Citation Bebbington, DBinch, HCharrier, JDEveritt, SFraysse, DGolec, JKay, DKnegtel, RMak, CMazzei, FMiller, AMortimore, MO'Donnell, MPatel, SPierard, FPinder, JPollard, JRamaya, SRobinson, DRutherford, AStudley, JWestcott, J The discovery of the potent aurora inhibitor MK-0457 (VX-680). Bioorg Med Chem Lett19:3586-92 (2009) 
 
Aurora kinase A
Name:Aurora kinase A
Type:Serine/threonine-protein kinase
Mol. Mass.:45830.98
Organism:Homo sapiens (Human)
Description:O14965
Residue:403
BDBM50293692
NameBDBM50293692
Synonyms:CHEMBL562497 | N-(4-(4-methyl-6-(5-methyl-1H-pyrazol-3-ylamino)pyrimidin-2-ylthio)phenyl)acetamide
TypeSmall organic molecule
Emp. Form.C17H18N6OS
Mol. Mass.354.429
SMILESCC(=O)Nc1ccc(Sc2nc(C)cc(Nc3cc(C)n[nH]3)n2)cc1