Reaction Details
TargetAurora kinase A
LigandBDBM50277638
Substrate/Competitorn/a
Meas. Tech.ChEMBL_571639 (CHEMBL1031294)
Ki 3.7±n/a nM
Citation Bebbington, DBinch, HCharrier, JDEveritt, SFraysse, DGolec, JKay, DKnegtel, RMak, CMazzei, FMiller, AMortimore, MO'Donnell, MPatel, SPierard, FPinder, JPollard, JRamaya, SRobinson, DRutherford, AStudley, JWestcott, J The discovery of the potent aurora inhibitor MK-0457 (VX-680). Bioorg Med Chem Lett19:3586-92 (2009) 
 
Aurora kinase A
Name:Aurora kinase A
Type:Serine/threonine-protein kinase
Mol. Mass.:45830.98
Organism:Homo sapiens (Human)
Description:O14965
Residue:403
BDBM50277638
NameBDBM50277638
Synonyms:CHEMBL482779 | N-(4-(4-(5-methyl-1H-pyrazol-3-ylamino)-6-(piperazin-1-yl)pyrimidin-2-ylthio)phenyl)propionamide
TypeSmall organic molecule
Emp. Form.C21H26N8OS
Mol. Mass.438.549
SMILESCCC(=O)Nc1ccc(Sc2nc(Nc3cc(C)n[nH]3)cc(n2)N2CCNCC2)cc1