Reaction Details
TargetHistone deacetylase-like amidohydrolase
LigandBDBM19149
Substrate/Competitorn/a
Meas. Tech.ChEMBL_571661 (CHEMBL1031316)
Ki 1300±n/a nM
Citation Riester, DHildmann, CHaus, PGaletovic, ASchober, ASchwienhorst, AMeyer-Almes, FJ Non-isotopic dual parameter competition assay suitable for high-throughput screening of histone deacetylases. Bioorg Med Chem Lett19:3651-6 (2009) 
 
Histone deacetylase-like amidohydrolase
Name:Histone deacetylase-like amidohydrolase
Type:PROTEIN
Mol. Mass.:39419.78
Organism:Alcaligenes sp. (strain DSM 11172) (Bordetella sp. (strain FB188))
Description:ChEMBL_827139
Residue:369
BDBM19149
NameBDBM19149
Synonyms:CHEMBL98 SAHA US10188756, Compound SAHA US11505523, Compound SAHA US9353061, SAHA US9695181, Vorinostat Zolinza suberoylanilide hydroxamic acid
TypeSmall organic molecule
Emp. Form.C14H20N2O3
Mol. Mass.264.3202
SMILESONC(=O)CCCCCCC(=O)Nc1ccccc1