Reaction Details
TargetHistone deacetylase-like amidohydrolase
LigandBDBM19130
Substrate/Competitorn/a
Meas. Tech.ChEMBL_571662 (CHEMBL1031317)
IC50 1200±n/a nM
Citation Riester, DHildmann, CHaus, PGaletovic, ASchober, ASchwienhorst, AMeyer-Almes, FJ Non-isotopic dual parameter competition assay suitable for high-throughput screening of histone deacetylases. Bioorg Med Chem Lett19:3651-6 (2009) 
 
Histone deacetylase-like amidohydrolase
Name:Histone deacetylase-like amidohydrolase
Type:PROTEIN
Mol. Mass.:39419.78
Organism:Alcaligenes sp. (strain DSM 11172) (Bordetella sp. (strain FB188))
Description:ChEMBL_827139
Residue:369
BDBM19130
NameBDBM19130
Synonyms:(2E,4E,6R)-7-[4-(dimethylamino)phenyl]-N-hydroxy-4,6-dimethyl-7-oxohepta-2,4-dienamide TSA | Trichostatin A (TSA)
TypeSmall organic molecule
Emp. Form.C17H22N2O3
Mol. Mass.302.3682
SMILESCC(C=CC(=O)NO)C=C(C)C(=O)c1ccc(cc1)N(C)C