Reaction Details
TargetHistone deacetylase-like amidohydrolase
LigandBDBM50293703
Substrate/Competitorn/a
Meas. Tech.ChEMBL_571663 (CHEMBL1031318)
IC50 600±n/a nM
Citation Riester, DHildmann, CHaus, PGaletovic, ASchober, ASchwienhorst, AMeyer-Almes, FJ Non-isotopic dual parameter competition assay suitable for high-throughput screening of histone deacetylases. Bioorg Med Chem Lett19:3651-6 (2009) 
 
Histone deacetylase-like amidohydrolase
Name:Histone deacetylase-like amidohydrolase
Type:PROTEIN
Mol. Mass.:39419.78
Organism:Alcaligenes sp. (strain DSM 11172) (Bordetella sp. (strain FB188))
Description:ChEMBL_827139
Residue:369
BDBM50293703
NameBDBM50293703
Synonyms:2-ethyl-3-methoxy-6-methyl-5-(11-oxododecyl)cyclohexa-2,5-diene-1,4-dione | CHEMBL561154
TypeSmall organic molecule
Emp. Form.C22H34O4
Mol. Mass.362.503
SMILESCCc1c(O)c(C)c(C=CCCCCCCCCC(C)=O)c(O)c1OC