Reaction Details
TargetHistone deacetylase-like amidohydrolase
LigandBDBM50293705
Substrate/Competitorn/a
Meas. Tech.ChEMBL_571663 (CHEMBL1031318)
IC50 6200±n/a nM
Citation Riester, DHildmann, CHaus, PGaletovic, ASchober, ASchwienhorst, AMeyer-Almes, FJ Non-isotopic dual parameter competition assay suitable for high-throughput screening of histone deacetylases. Bioorg Med Chem Lett19:3651-6 (2009) 
 
Histone deacetylase-like amidohydrolase
Name:Histone deacetylase-like amidohydrolase
Type:PROTEIN
Mol. Mass.:39419.78
Organism:Alcaligenes sp. (strain DSM 11172) (Bordetella sp. (strain FB188))
Description:ChEMBL_827139
Residue:369
BDBM50293705
NameBDBM50293705
Synonyms:((2R,3S,4S,5R,6S)-6-((2R,3R,4S,5S,6R)-4,5-dihydroxy-6-(hydroxymethyl)-2-((R)-tetradecan-2-yloxy)-tetrahydro-2H-pyran-3-yloxy)-3,4,5-trihydroxy-tetrahydro-2H-pyran-2-yl)methyl acetate | CHEMBL558350
TypeSmall organic molecule
Emp. Form.C28H52O12
Mol. Mass.580.7053
SMILESCCCCCCCCCCCC[C@@H](C)O[C@@H]1O[C@H](CO)[C@@H](O)[C@H](O)[C@H]1O[C@@H]1O[C@H](COC(C)=O)[C@@H](O)[C@H](O)[C@H]1O