Reaction Details
TargetMetabotropic glutamate receptor 4
LigandBDBM50293714
Substrate/Competitorn/a
Meas. Tech.ChEMBL_571881 (CHEMBL1034751)
EC50 370±n/a nM
Citation Engers, DWNiswender, CMWeaver, CDJadhav, SMenon, UNZamorano, RConn, PJLindsley, CWHopkins, CR Synthesis and evaluation of a series of heterobiarylamides that are centrally penetrant metabotropic glutamate receptor 4 (mGluR4) positive allosteric modulators (PAMs). J Med Chem52:4115-8 (2009) 
 
Metabotropic glutamate receptor 4
Name:Metabotropic glutamate receptor 4
Type:Enzyme
Mol. Mass.:101849.79
Organism:Rattus norvegicus (Rat)
Description:P31423
Residue:912
BDBM50293714
NameBDBM50293714
Synonyms:CHEMBL551635 cid_42644786
TypeSmall organic molecule
Emp. Form.C13H11FN2O2
Mol. Mass.246.237
SMILESCOc1cc(NC(=O)c2ccccn2)ccc1F