Reaction Details
TargetMetabotropic glutamate receptor 4
LigandBDBM50293715
Substrate/Competitorn/a
Meas. Tech.ChEMBL_571881 (CHEMBL1034751)
EC50 500±n/a nM
Citation Engers, DWNiswender, CMWeaver, CDJadhav, SMenon, UNZamorano, RConn, PJLindsley, CWHopkins, CR Synthesis and evaluation of a series of heterobiarylamides that are centrally penetrant metabotropic glutamate receptor 4 (mGluR4) positive allosteric modulators (PAMs). J Med Chem52:4115-8 (2009) 
 
Metabotropic glutamate receptor 4
Name:Metabotropic glutamate receptor 4
Type:Enzyme
Mol. Mass.:101849.79
Organism:Rattus norvegicus (Rat)
Description:P31423
Residue:912
BDBM50293715
NameBDBM50293715
Synonyms:CHEMBL562036 cid_738280
TypeSmall organic molecule
Emp. Form.C13H10N2O3
Mol. Mass.242.2301
SMILESO=C(Nc1ccc2OCOc2c1)c1ccccn1