Reaction Details
TargetMetabotropic glutamate receptor 4
LigandBDBM50293720
Substrate/Competitorn/a
Meas. Tech.ChEMBL_571886 (CHEMBL1034756)
EC50 340±n/a nM
Citation Engers, DWNiswender, CMWeaver, CDJadhav, SMenon, UNZamorano, RConn, PJLindsley, CWHopkins, CR Synthesis and evaluation of a series of heterobiarylamides that are centrally penetrant metabotropic glutamate receptor 4 (mGluR4) positive allosteric modulators (PAMs). J Med Chem52:4115-8 (2009) 
 
Metabotropic glutamate receptor 4
Name:Metabotropic glutamate receptor 4
Type:Protein
Mol. Mass.:101899.95
Organism:Homo sapiens (Human)
Description:Q14833
Residue:912
BDBM50293720
NameBDBM50293720
Synonyms:CHEMBL541754 cid_44189740
TypeSmall organic molecule
Emp. Form.C13H10F2N2O2
Mol. Mass.264.2275
SMILESFC(F)Oc1cccc(NC(=O)c2ccccn2)c1