Reaction Details
TargetMetabotropic glutamate receptor 4
LigandBDBM50293723
Substrate/Competitorn/a
Meas. Tech.ChEMBL_571886 (CHEMBL1034756)
EC50>5000±n/a nM
Citation Engers, DWNiswender, CMWeaver, CDJadhav, SMenon, UNZamorano, RConn, PJLindsley, CWHopkins, CR Synthesis and evaluation of a series of heterobiarylamides that are centrally penetrant metabotropic glutamate receptor 4 (mGluR4) positive allosteric modulators (PAMs). J Med Chem52:4115-8 (2009) 
 
Metabotropic glutamate receptor 4
Name:Metabotropic glutamate receptor 4
Type:Protein
Mol. Mass.:101899.95
Organism:Homo sapiens (Human)
Description:Q14833
Residue:912
BDBM50293723
NameBDBM50293723
Synonyms:CHEMBL551004 cid_308065
TypeSmall organic molecule
Emp. Form.C11H7Cl2NO2
Mol. Mass.256.085
SMILESClc1ccc(NC(=O)c2ccco2)cc1Cl