Reaction Details
TargetMetabotropic glutamate receptor 4
LigandBDBM50293724
Substrate/Competitorn/a
Meas. Tech.ChEMBL_571886 (CHEMBL1034756)
EC50 4100±n/a nM
Citation Engers, DWNiswender, CMWeaver, CDJadhav, SMenon, UNZamorano, RConn, PJLindsley, CWHopkins, CR Synthesis and evaluation of a series of heterobiarylamides that are centrally penetrant metabotropic glutamate receptor 4 (mGluR4) positive allosteric modulators (PAMs). J Med Chem52:4115-8 (2009) 
 
Metabotropic glutamate receptor 4
Name:Metabotropic glutamate receptor 4
Type:Protein
Mol. Mass.:101899.95
Organism:Homo sapiens (Human)
Description:Q14833
Residue:912
BDBM50293724
NameBDBM50293724
Synonyms:5-bromo-N-(3,4-dichlorophenyl)furan-2-carboxamide | CHEMBL556535
TypeSmall organic molecule
Emp. Form.C11H6BrCl2NO2
Mol. Mass.334.981
SMILESClc1ccc(NC(=O)c2ccc(Br)o2)cc1Cl