Reaction Details
TargetKinesin-like protein KIF11
LigandBDBM50293760
Substrate/Competitorn/a
Meas. Tech.ChEMBL_571916 (CHEMBL1035565)
IC50 2300±n/a nM
Citation Lahue, BRMa, YShipps, GWSeghezzi, WHerbst, R Substituted benzimidazoles: A novel chemotype for small molecule hKSP inhibitors. Bioorg Med Chem Lett19:3405-9 (2009) 
 
Kinesin-like protein KIF11
Name:Kinesin-like protein KIF11
Type:PROTEIN
Mol. Mass.:119138.97
Organism:Homo sapiens (Human)
Description:ChEMBL_1457426
Residue:1056
BDBM50293760
NameBDBM50293760
Synonyms:2-(3-fluoro-4-methoxyphenylamino)-1-(2-(trifluoromethyl)benzyl)-1H-benzo[d]imidazole-5-carboxylic acid | CHEMBL558476
TypeSmall organic molecule
Emp. Form.C23H17F4N3O3
Mol. Mass.459.393
SMILESCOc1ccc(Nc2nc3cc(ccc3n2Cc2ccccc2C(F)(F)F)C(O)=O)cc1F