Reaction Details
TargetKinesin-like protein KIF3B
LigandBDBM50293745
Substrate/Competitorn/a
Meas. Tech.ChEMBL_571922 (CHEMBL1035571)
IC50>50000±n/a nM
Citation Lahue, BRMa, YShipps, GWSeghezzi, WHerbst, R Substituted benzimidazoles: A novel chemotype for small molecule hKSP inhibitors. Bioorg Med Chem Lett19:3405-9 (2009) 
 
Kinesin-like protein KIF3B
Name:Kinesin-like protein KIF3B
Type:PROTEIN
Mol. Mass.:85132.22
Organism:Homo sapiens (Human)
Description:ChEMBL_571922
Residue:747
BDBM50293745
NameBDBM50293745
Synonyms:2-(4-sulfamoylphenylamino)-1-(1-(2-(trifluoromethyl)phenyl)ethyl)-1H-benzo[d]imidazole-5-carboxamide | CHEMBL552298
TypeSmall organic molecule
Emp. Form.C23H20F3N5O3S
Mol. Mass.503.497
SMILESCC(c1ccccc1C(F)(F)F)n1c(Nc2ccc(cc2)S(N)(=O)=O)nc2cc(ccc12)C(N)=O