Reaction Details
TargetKinesin-like protein KIF3B
LigandBDBM50293751
Substrate/Competitorn/a
Meas. Tech.ChEMBL_571922 (CHEMBL1035571)
IC50>50000±n/a nM
Citation Lahue, BRMa, YShipps, GWSeghezzi, WHerbst, R Substituted benzimidazoles: A novel chemotype for small molecule hKSP inhibitors. Bioorg Med Chem Lett19:3405-9 (2009) 
 
Kinesin-like protein KIF3B
Name:Kinesin-like protein KIF3B
Type:PROTEIN
Mol. Mass.:85132.22
Organism:Homo sapiens (Human)
Description:ChEMBL_571922
Residue:747
BDBM50293751
NameBDBM50293751
Synonyms:1-((5-chlorobenzo[b]thiophen-3-yl)methyl)-2-(4-sulfamoylphenylamino)-1H-benzo[d]imidazole-5-carboxamide | CHEMBL561294
TypeSmall organic molecule
Emp. Form.C23H18ClN5O3S2
Mol. Mass.512.004
SMILESNC(=O)c1ccc2n(Cc3csc4ccc(Cl)cc34)c(Nc3ccc(cc3)S(N)(=O)=O)nc2c1