Reaction Details
TargetKinesin-like protein KIF3B
LigandBDBM50293760
Substrate/Competitorn/a
Meas. Tech.ChEMBL_571922 (CHEMBL1035571)
IC50>50000±n/a nM
Citation Lahue, BRMa, YShipps, GWSeghezzi, WHerbst, R Substituted benzimidazoles: A novel chemotype for small molecule hKSP inhibitors. Bioorg Med Chem Lett19:3405-9 (2009) 
 
Kinesin-like protein KIF3B
Name:Kinesin-like protein KIF3B
Type:PROTEIN
Mol. Mass.:85132.22
Organism:Homo sapiens (Human)
Description:ChEMBL_571922
Residue:747
BDBM50293760
NameBDBM50293760
Synonyms:2-(3-fluoro-4-methoxyphenylamino)-1-(2-(trifluoromethyl)benzyl)-1H-benzo[d]imidazole-5-carboxylic acid | CHEMBL558476
TypeSmall organic molecule
Emp. Form.C23H17F4N3O3
Mol. Mass.459.393
SMILESCOc1ccc(Nc2nc3cc(ccc3n2Cc2ccccc2C(F)(F)F)C(O)=O)cc1F