Reaction Details
TargetKinesin-like protein KIF3B
LigandBDBM50293762
Substrate/Competitorn/a
Meas. Tech.ChEMBL_571922 (CHEMBL1035571)
IC50>50000±n/a nM
Citation Lahue, BRMa, YShipps, GWSeghezzi, WHerbst, R Substituted benzimidazoles: A novel chemotype for small molecule hKSP inhibitors. Bioorg Med Chem Lett19:3405-9 (2009) 
 
Kinesin-like protein KIF3B
Name:Kinesin-like protein KIF3B
Type:PROTEIN
Mol. Mass.:85132.22
Organism:Homo sapiens (Human)
Description:ChEMBL_571922
Residue:747
BDBM50293762
NameBDBM50293762
Synonyms:CHEMBL558477 | methyl 2-(4-sulfamoylphenylamino)-1-(2-(trifluoromethyl)benzyl)-1H-benzo[d]imidazole-5-carboxylate
TypeSmall organic molecule
Emp. Form.C23H19F3N4O4S
Mol. Mass.504.482
SMILESCOC(=O)c1ccc2n(Cc3ccccc3C(F)(F)F)c(Nc3ccc(cc3)S(N)(=O)=O)nc2c1