Reaction Details
TargetKinesin-like protein KIF3B
LigandBDBM50293768
Substrate/Competitorn/a
Meas. Tech.ChEMBL_571922 (CHEMBL1035571)
IC50>50000±n/a nM
Citation Lahue, BRMa, YShipps, GWSeghezzi, WHerbst, R Substituted benzimidazoles: A novel chemotype for small molecule hKSP inhibitors. Bioorg Med Chem Lett19:3405-9 (2009) 
 
Kinesin-like protein KIF3B
Name:Kinesin-like protein KIF3B
Type:PROTEIN
Mol. Mass.:85132.22
Organism:Homo sapiens (Human)
Description:ChEMBL_571922
Residue:747
BDBM50293768
NameBDBM50293768
Synonyms:4-(5-(pyrrolidine-1-carbonyl)-1-(2-(trifluoromethyl)benzyl)-1H-benzo[d]imidazol-2-ylamino)benzenesulfonamide | CHEMBL559435
TypeSmall organic molecule
Emp. Form.C26H24F3N5O3S
Mol. Mass.543.561
SMILESNS(=O)(=O)c1ccc(Nc2nc3cc(ccc3n2Cc2ccccc2C(F)(F)F)C(=O)N2CCCC2)cc1