Reaction Details
TargetKinesin-like protein KIF3B
LigandBDBM50293771
Substrate/Competitorn/a
Meas. Tech.ChEMBL_571922 (CHEMBL1035571)
IC50>50000±n/a nM
Citation Lahue, BRMa, YShipps, GWSeghezzi, WHerbst, R Substituted benzimidazoles: A novel chemotype for small molecule hKSP inhibitors. Bioorg Med Chem Lett19:3405-9 (2009) 
 
Kinesin-like protein KIF3B
Name:Kinesin-like protein KIF3B
Type:PROTEIN
Mol. Mass.:85132.22
Organism:Homo sapiens (Human)
Description:ChEMBL_571922
Residue:747
BDBM50293771
NameBDBM50293771
Synonyms:2-(3-aminopyrrolidin-1-yl)-1-(2-(trifluoromethyl)benzyl)-1H-benzo[d]imidazole-5-carboxylic acid | CHEMBL564345
TypeSmall organic molecule
Emp. Form.C20H19F3N4O2
Mol. Mass.404.3857
SMILESNC1CCN(C1)c1nc2cc(ccc2n1Cc1ccccc1C(F)(F)F)C(O)=O