Reaction Details
TargetKinesin heavy chain isoform 5A
LigandBDBM50293747
Substrate/Competitorn/a
Meas. Tech.ChEMBL_571923 (CHEMBL1035572)
IC50>50000±n/a nM
Citation Lahue, BRMa, YShipps, GWSeghezzi, WHerbst, R Substituted benzimidazoles: A novel chemotype for small molecule hKSP inhibitors. Bioorg Med Chem Lett19:3405-9 (2009) 
 
Kinesin heavy chain isoform 5A
Name:Kinesin heavy chain isoform 5A
Type:PROTEIN
Mol. Mass.:117363.74
Organism:Homo sapiens (Human)
Description:ChEMBL_818702
Residue:1032
BDBM50293747
NameBDBM50293747
Synonyms:1-(pyridin-2-ylmethyl)-2-(4-sulfamoylphenylamino)-1H-benzo[d]imidazole-5-carboxamide | CHEMBL565048
TypeSmall organic molecule
Emp. Form.C20H18N6O3S
Mol. Mass.422.46
SMILESNC(=O)c1ccc2n(Cc3ccccn3)c(Nc3ccc(cc3)S(N)(=O)=O)nc2c1