Reaction Details
TargetKinesin heavy chain isoform 5A
LigandBDBM50293749
Substrate/Competitorn/a
Meas. Tech.ChEMBL_571923 (CHEMBL1035572)
IC50>50000±n/a nM
Citation Lahue, BRMa, YShipps, GWSeghezzi, WHerbst, R Substituted benzimidazoles: A novel chemotype for small molecule hKSP inhibitors. Bioorg Med Chem Lett19:3405-9 (2009) 
 
Kinesin heavy chain isoform 5A
Name:Kinesin heavy chain isoform 5A
Type:PROTEIN
Mol. Mass.:117363.74
Organism:Homo sapiens (Human)
Description:ChEMBL_818702
Residue:1032
BDBM50293749
NameBDBM50293749
Synonyms:1-(2,3-dimethoxybenzyl)-2-(4-sulfamoylphenylamino)-1H-benzo[d]imidazole-5-carboxamide | CHEMBL564451
TypeSmall organic molecule
Emp. Form.C23H23N5O5S
Mol. Mass.481.524
SMILESCOc1cccc(Cn2c(Nc3ccc(cc3)S(N)(=O)=O)nc3cc(ccc23)C(N)=O)c1OC