Reaction Details
TargetKinesin heavy chain isoform 5A
LigandBDBM50293767
Substrate/Competitorn/a
Meas. Tech.ChEMBL_571923 (CHEMBL1035572)
IC50>50000±n/a nM
Citation Lahue, BRMa, YShipps, GWSeghezzi, WHerbst, R Substituted benzimidazoles: A novel chemotype for small molecule hKSP inhibitors. Bioorg Med Chem Lett19:3405-9 (2009) 
 
Kinesin heavy chain isoform 5A
Name:Kinesin heavy chain isoform 5A
Type:PROTEIN
Mol. Mass.:117363.74
Organism:Homo sapiens (Human)
Description:ChEMBL_818702
Residue:1032
BDBM50293767
NameBDBM50293767
Synonyms:CHEMBL559627 | N,N-dimethyl-2-(4-sulfamoylphenylamino)-1-(2-(trifluoromethyl)benzyl)-1H-benzo[d]imidazole-5-carboxamide
TypeSmall organic molecule
Emp. Form.C24H22F3N5O3S
Mol. Mass.517.523
SMILESCN(C)C(=O)c1ccc2n(Cc3ccccc3C(F)(F)F)c(Nc3ccc(cc3)S(N)(=O)=O)nc2c1