Reaction Details
TargetKinesin heavy chain isoform 5A
LigandBDBM50293771
Substrate/Competitorn/a
Meas. Tech.ChEMBL_571923 (CHEMBL1035572)
IC50>50000±n/a nM
Citation Lahue, BRMa, YShipps, GWSeghezzi, WHerbst, R Substituted benzimidazoles: A novel chemotype for small molecule hKSP inhibitors. Bioorg Med Chem Lett19:3405-9 (2009) 
 
Kinesin heavy chain isoform 5A
Name:Kinesin heavy chain isoform 5A
Type:PROTEIN
Mol. Mass.:117363.74
Organism:Homo sapiens (Human)
Description:ChEMBL_818702
Residue:1032
BDBM50293771
NameBDBM50293771
Synonyms:2-(3-aminopyrrolidin-1-yl)-1-(2-(trifluoromethyl)benzyl)-1H-benzo[d]imidazole-5-carboxylic acid | CHEMBL564345
TypeSmall organic molecule
Emp. Form.C20H19F3N4O2
Mol. Mass.404.3857
SMILESNC1CCN(C1)c1nc2cc(ccc2n1Cc1ccccc1C(F)(F)F)C(O)=O