Reaction Details
TargetKinesin heavy chain isoform 5A
LigandBDBM50293776
Substrate/Competitorn/a
Meas. Tech.ChEMBL_571923 (CHEMBL1035572)
IC50>50000±n/a nM
Citation Lahue, BRMa, YShipps, GWSeghezzi, WHerbst, R Substituted benzimidazoles: A novel chemotype for small molecule hKSP inhibitors. Bioorg Med Chem Lett19:3405-9 (2009) 
 
Kinesin heavy chain isoform 5A
Name:Kinesin heavy chain isoform 5A
Type:PROTEIN
Mol. Mass.:117363.74
Organism:Homo sapiens (Human)
Description:ChEMBL_818702
Residue:1032
BDBM50293776
NameBDBM50293776
Synonyms:2-(2-morpholinoethylamino)-1-(2-(trifluoromethyl)benzyl)-1H-benzo[d]imidazole-5-carboxylic acid | CHEMBL549873
TypeSmall organic molecule
Emp. Form.C22H23F3N4O3
Mol. Mass.448.4382
SMILESOC(=O)c1ccc2n(Cc3ccccc3C(F)(F)F)c(NCCN3CCOCC3)nc2c1