Reaction Details
TargetSmoothened homolog
LigandBDBM50293788
Substrate/Competitorn/a
Meas. Tech.ChEMBL_572237 (CHEMBL1031015)
IC50 1.4±n/a nM
Citation Tremblay, MRLescarbeau, AGrogan, MJTan, ELin, GAustad, BCYu, LCBehnke, MLNair, SJHagel, MWhite, KConley, JManna, JDAlvarez-Diez, TMHoyt, JWoodward, CNSydor, JRPink, MMacDougall, JCampbell, MJCushing, JFerguson, JCurtis, MSMcGovern, KRead, MAPalombella, VJAdams, JCastro, AC Discovery of a potent and orally active hedgehog pathway antagonist (IPI-926). J Med Chem52:4400-18 (2009) 
 
Smoothened homolog
Name:Smoothened homolog
Type:Protein
Mol. Mass.:86415.51
Organism:Homo sapiens (Human)
Description:Q99835
Residue:787
BDBM50293788
NameBDBM50293788
Synonyms:CHEMBL538867 US10314827, Compound 42
TypeSmall organic molecule
Emp. Form.C29H48N2O3S
Mol. Mass.504.768
SMILESC[C@@H]1[C@@H]2NC[C@@H](C)C[C@H]2O[C@]11CC[C@H]2[C@@H]3CC[C@@H]4C[C@@H](CC[C@]4(C)[C@H]3CC2=C(C)C1)NS(C)(=O)=O