Reaction Details
TargetHypoxanthine-guanine phosphoribosyltransferase
LigandBDBM50293834
Substrate/Competitorn/a
Meas. Tech.ChEMBL_572371 (CHEMBL1035272)
pH7.4±n/a
Ki 90000±n/a nM
Commentsextracted
Citation Keough, DTHocková, DHolý, ANaesens, LMSkinner-Adams, TSJersey, JGuddat, LW Inhibition of hypoxanthine-guanine phosphoribosyltransferase by acyclic nucleoside phosphonates: a new class of antimalarial therapeutics. J Med Chem52:4391-9 (2009) 
 
Hypoxanthine-guanine phosphoribosyltransferase
Name:Hypoxanthine-guanine phosphoribosyltransferase
Type:Protein
Mol. Mass.:24579.61
Organism:Homo sapiens (Human)
Description:P00492
Residue:218
BDBM50293834
NameBDBM50293834
Synonyms:(S)-5-(2-Amino-6-oxo-1,6,7,8-tetrahydro-purin-9-ylmethyl)-2-oxo-2lambda*5*-[1,4,2]dioxaphosphinan-2-ol anion | CHEMBL557887
TypeSmall organic molecule
Emp. Form.C9H14N5O5P
Mol. Mass.303.2117
SMILESNc1nc2N(C[C@H]3COP(O)(=O)CO3)CNc2c(=O)[nH]1