Reaction Details
TargetKappa-type opioid receptor
LigandBDBM50293855
Substrate/Competitorn/a
Meas. Tech.ChEMBL_572571 (CHEMBL1025187)
IC50 10000±n/a nM
Citation Satoh, ASagara, TSakoh, HHashimoto, MNakashima, HKato, TGoto, YMizutani, SAzuma-Kanoh, TTani, TOkuda, SOkamoto, OOzaki, SIwasawa, YOhta, HKawamoto, H Identification of an orally active opioid receptor-like 1 (ORL1) receptor antagonist 4-{3-[(2R)-2,3-dihydroxypropyl]-2-oxo-2,3-dihydro-1H-benzimidazol-1-yl}-1-[(1S,3S,4R)-spiro[bicyclo[2.2.1]heptane-2,1'-cyclopropan]-3-ylmethyl]piperidine as clinical candidate. J Med Chem52:4091-4 (2009) 
 
Kappa-type opioid receptor
Name:Kappa-type opioid receptor
Type:G Protein-Coupled Receptor (GPCR)
Mol. Mass.:42648.76
Organism:Homo sapiens (Human)
Description:P41145
Residue:380
BDBM50293855
NameBDBM50293855
Synonyms:4-{3-[(2R)-2,3-dihydroxypropyl]-2-oxo-2,3-dihydro-1H-benzimidazol-1-yl}-1-[(1S,3S,4R)-spiro[bicyclo[2.2.1]heptane-2,1'-cyclopropan]-3-ylmethyl]piperidine hydrochloride | CHEMBL564840
TypeSmall organic molecule
Emp. Form.C25H35N3O3
Mol. Mass.425.5637
SMILESOC[C@H](O)Cn1c2ccccc2n(C2CCN(C[C@H]3[C@H]4CC[C@H](C4)C33CC3)CC2)c1=O