Reaction Details
TargetZinc finger protein GLI1
LigandBDBM50293861
Substrate/Competitorn/a
Meas. Tech.ChEMBL_572601 (CHEMBL1026025)
IC50 11400±n/a nM
Citation Mahindroo, NConnelly, MCPunchihewa, CKimura, HSmeltzer, MPWu, SFujii, N Structure-activity relationships and cancer-cell selective toxicity of novel inhibitors of glioma-associated oncogene homologue 1 (Gli1) mediated transcription. J Med Chem52:4277-87 (2009) 
 
Zinc finger protein GLI1
Name:Zinc finger protein GLI1
Type:PROTEIN
Mol. Mass.:117920.33
Organism:Homo sapiens (Human)
Description:ChEMBL_537531
Residue:1106
BDBM50293861
NameBDBM50293861
Synonyms:(S)-2-(3-Benzoylphenyl)-N-(4-hydroxyphenethyl)propanamide | CHEMBL562034
TypeSmall organic molecule
Emp. Form.C24H23NO3
Mol. Mass.373.4443
SMILESC[C@H](C(=O)NCCc1ccc(O)cc1)c1cccc(c1)C(=O)c1ccccc1