Reaction Details
TargetCorticotropin-releasing factor receptor 1
LigandBDBM50293958
Substrate/Competitorn/a
Meas. Tech.ChEMBL_572726 (CHEMBL1030150)
IC50 2.4±n/a nM
Citation Hartz, RAAhuja, VTArvanitis, AGRafalski, MYue, EWDenhart, DJSchmitz, WDDitta, JLDeskus, JABrenner, ABHobbs, FWPayne, JLelas, SLi, YWMolski, TFMattson, GKPeng, YWong, HGrace, JELentz, KAQian-Cutrone, JZhuo, XShu, YZLodge, NJZaczek, RCombs, APOlson, REBronson, JJMattson, RJMacor, JE Synthesis, structure-activity relationships, and in vivo evaluation of N3-phenylpyrazinones as novel corticotropin-releasing factor-1 (CRF1) receptor antagonists. J Med Chem52:4173-91 (2009) 
 
Corticotropin-releasing factor receptor 1
Name:Corticotropin-releasing factor receptor 1
Type:G Protein-Coupled Receptor (GPCR)
Mol. Mass.:47870.75
Organism:Rattus norvegicus (rat)
Description:Receptor binding assays were performed using rat cortex homogenate.
Residue:415
BDBM50293958
NameBDBM50293958
Synonyms:5-Chloro-1-(1-propylbutyl)-3-(2,4,6-trimethylphenylamino)-pyrazin-2(1H)-one | CHEMBL559633
TypeSmall organic molecule
Emp. Form.C20H28ClN3O
Mol. Mass.361.909
SMILESCCCC(CCC)n1cc(Cl)nc(Nc2c(C)cc(C)cc2C)c1=O