Reaction Details
TargetD(3) dopamine receptor
LigandBDBM50294118
Substrate/Competitorn/a
Meas. Tech.ChEMBL_570886 (CHEMBL1031083)
Ki 370±n/a nM
Citation Ehrlich, KGötz, ABollinger, STschammer, NBettinetti, LHärterich, SHübner, HLanig, HGmeiner, P Dopamine D2, D3, and D4 selective phenylpiperazines as molecular probes to explore the origins of subtype specific receptor binding. J Med Chem52:4923-35 (2009) 
 
D(3) dopamine receptor
Name:D(3) dopamine receptor
Type:n/a
Mol. Mass.:44243.43
Organism:Homo sapiens (Human)
Description:n/a
Residue:400
BDBM50294118
NameBDBM50294118
Synonyms:2-[5-[4-(4-Chlorophenyl)piperazin-1-yl]pentyl]pyrazolo[1,5-a]-pyridine | CHEMBL561622
TypeSmall organic molecule
Emp. Form.C22H27ClN4
Mol. Mass.382.93
SMILESClc1ccc(cc1)N1CCN(CCCCCc2cc3ccccn3n2)CC1