Reaction Details
TargetD(3) dopamine receptor
LigandBDBM50294115
Substrate/Competitorn/a
Meas. Tech.ChEMBL_570886 (CHEMBL1031083)
Ki 0.35±n/a nM
Citation Ehrlich, KGötz, ABollinger, STschammer, NBettinetti, LHärterich, SHübner, HLanig, HGmeiner, P Dopamine D2, D3, and D4 selective phenylpiperazines as molecular probes to explore the origins of subtype specific receptor binding. J Med Chem52:4923-35 (2009) 
 
D(3) dopamine receptor
Name:D(3) dopamine receptor
Type:n/a
Mol. Mass.:44243.43
Organism:Homo sapiens (Human)
Description:n/a
Residue:400
BDBM50294115
NameBDBM50294115
Synonyms:CHEMBL550222 | N-(4-(4-(2-(methylthio)phenyl)piperazin-1-yl)butyl)H-pyrazolo[1,5-a]pyridine-2-carboxamide
TypeSmall organic molecule
Emp. Form.C23H29N5OS
Mol. Mass.423.574
SMILESCSc1ccccc1N1CCN(CCCCNC(=O)c2cc3ccccn3n2)CC1