Reaction Details
TargetD(2) dopamine receptor
LigandBDBM50294115
Substrate/Competitorn/a
Meas. Tech.ChEMBL_570891 (CHEMBL1031088)
Ki 37±n/a nM
Citation Ehrlich, KGötz, ABollinger, STschammer, NBettinetti, LHärterich, SHübner, HLanig, HGmeiner, P Dopamine D2, D3, and D4 selective phenylpiperazines as molecular probes to explore the origins of subtype specific receptor binding. J Med Chem52:4923-35 (2009) 
 
D(2) dopamine receptor
Name:D(2) dopamine receptor
Type:Cell-surface receptors
Mol. Mass.:50647.10
Organism:Homo sapiens (Human)
Description:P14416
Residue:443
BDBM50294115
NameBDBM50294115
Synonyms:CHEMBL550222 | N-(4-(4-(2-(methylthio)phenyl)piperazin-1-yl)butyl)H-pyrazolo[1,5-a]pyridine-2-carboxamide
TypeSmall organic molecule
Emp. Form.C23H29N5OS
Mol. Mass.423.574
SMILESCSc1ccccc1N1CCN(CCCCNC(=O)c2cc3ccccn3n2)CC1