Reaction Details
TargetD(2) dopamine receptor
LigandBDBM50119391
Substrate/Competitorn/a
Meas. Tech.ChEMBL_570891 (CHEMBL1031088)
Ki 150±n/a nM
Citation Ehrlich, KGötz, ABollinger, STschammer, NBettinetti, LHärterich, SHübner, HLanig, HGmeiner, P Dopamine D2, D3, and D4 selective phenylpiperazines as molecular probes to explore the origins of subtype specific receptor binding. J Med Chem52:4923-35 (2009) 
 
D(2) dopamine receptor
Name:D(2) dopamine receptor
Type:Cell-surface receptors
Mol. Mass.:50647.10
Organism:Homo sapiens (Human)
Description:P14416
Residue:443
BDBM50119391
NameBDBM50119391
Synonyms:CHEMBL142020 Pyrazolo[1,5-a]pyridine-2-carboxylic acid {4-[4-(2-methoxy-phenyl)-piperazin-1-yl]-butyl}-amide
TypeSmall organic molecule
Emp. Form.C23H29N5O2
Mol. Mass.407.5087
SMILESCOc1ccccc1N1CCN(CCCCNC(=O)c2cc3ccccn3n2)CC1