Reaction Details
TargetD(2) dopamine receptor
LigandBDBM50294117
Substrate/Competitorn/a
Meas. Tech.ChEMBL_570891 (CHEMBL1031088)
Ki 350±n/a nM
Citation Ehrlich, KGötz, ABollinger, STschammer, NBettinetti, LHärterich, SHübner, HLanig, HGmeiner, P Dopamine D2, D3, and D4 selective phenylpiperazines as molecular probes to explore the origins of subtype specific receptor binding. J Med Chem52:4923-35 (2009) 
 
D(2) dopamine receptor
Name:D(2) dopamine receptor
Type:Cell-surface receptors
Mol. Mass.:50647.10
Organism:Homo sapiens (Human)
Description:P14416
Residue:443
BDBM50294117
NameBDBM50294117
Synonyms:2-((4-(2-methoxyphenyl)piperazin-1-yl)methyl)H-pyrazolo[1,5-a]pyridine | CHEMBL562620
TypeSmall organic molecule
Emp. Form.C19H22N4O
Mol. Mass.322.4042
SMILESCOc1ccccc1N1CCN(Cc2cc3ccccn3n2)CC1