Reaction Details
TargetDihydrofolate reductase
LigandBDBM50294213
Substrate/Competitorn/a
Meas. Tech.ChEMBL_577084 (CHEMBL1031974)
IC50>24000±n/a nM
Citation Barrow, EWDreier, JReinelt, SBourne, PCBarrow, WW In vitro efficacy of new antifolates against trimethoprim-resistant Bacillus anthracis. Antimicrob Agents Chemother51:4447-52 (2007) 
 
Dihydrofolate reductase
Name:Dihydrofolate reductase
Type:Enzyme
Mol. Mass.:21453.99
Organism:Homo sapiens (Human)
Description:Recombinant human DHFR.
Residue:187
BDBM50294213
NameBDBM50294213
Synonyms:3-(5-((2,4-diaminopyrimidin-5-yl)methyl)-2-hydroxy-3-methoxyphenyl)-1-(1-(4-(hydroxymethyl)phenyl)phthalazin-2(1H)-yl)prop-2-en-1-one | CHEMBL559830
TypeSmall organic molecule
Emp. Form.C30H28N6O4
Mol. Mass.536.5811
SMILESCOc1cc(Cc2cnc(N)nc2N)cc(\C=C\C(=O)N2N=Cc3ccccc3C2c2ccc(CO)cc2)c1O