Reaction Details
TargetDihydrofolate reductase
LigandBDBM50294215
Substrate/Competitorn/a
Meas. Tech.ChEMBL_577084 (CHEMBL1031974)
IC50>22000±n/a nM
Citation Barrow, EWDreier, JReinelt, SBourne, PCBarrow, WW In vitro efficacy of new antifolates against trimethoprim-resistant Bacillus anthracis. Antimicrob Agents Chemother51:4447-52 (2007) 
 
Dihydrofolate reductase
Name:Dihydrofolate reductase
Type:Enzyme
Mol. Mass.:21453.99
Organism:Homo sapiens (Human)
Description:Recombinant human DHFR.
Residue:187
BDBM50294215
NameBDBM50294215
Synonyms:3-(5-((2,4-diaminopyrimidin-5-yl)methyl)-2,3-dimethoxyphenyl)-1-(1-(2,4-dimethoxypyrimidin-5-yl)phthalazin-2(1H)-yl)prop-2-en-1-one | CHEMBL539445
TypeSmall organic molecule
Emp. Form.C30H30N8O5
Mol. Mass.582.6098
SMILESCOc1ncc(C2N(N=Cc3ccccc23)C(=O)\C=C\c2cc(Cc3cnc(N)nc3N)cc(OC)c2OC)c(OC)n1