Reaction Details
TargetDihydrofolate reductase
LigandBDBM50294207
Substrate/Competitorn/a
Meas. Tech.ChEMBL_577084 (CHEMBL1031974)
IC50>16000±n/a nM
Citation Barrow, EWDreier, JReinelt, SBourne, PCBarrow, WW In vitro efficacy of new antifolates against trimethoprim-resistant Bacillus anthracis. Antimicrob Agents Chemother51:4447-52 (2007) 
 
Dihydrofolate reductase
Name:Dihydrofolate reductase
Type:Enzyme
Mol. Mass.:21453.99
Organism:Homo sapiens (Human)
Description:Recombinant human DHFR.
Residue:187
BDBM50294207
NameBDBM50294207
Synonyms:3-(5-((2,4-diaminopyrimidin-5-yl)methyl)-2,3-dimethoxyphenyl)-1-(1-phenylphthalazin-2(1H)-yl)prop-2-en-1-one CHEMBL565020
TypeSmall organic molecule
Emp. Form.C30H28N6O3
Mol. Mass.520.5817
SMILESCOc1cc(Cc2cnc(N)nc2N)cc(\C=C\C(=O)N2N=Cc3ccccc3C2c2ccccc2)c1OC