Reaction Details
TargetDihydrofolate reductase
LigandBDBM50294210
Substrate/Competitorn/a
Meas. Tech.ChEMBL_577084 (CHEMBL1031974)
IC50>20000±n/a nM
Citation Barrow, EWDreier, JReinelt, SBourne, PCBarrow, WW In vitro efficacy of new antifolates against trimethoprim-resistant Bacillus anthracis. Antimicrob Agents Chemother51:4447-52 (2007) 
 
Dihydrofolate reductase
Name:Dihydrofolate reductase
Type:Enzyme
Mol. Mass.:21453.99
Organism:Homo sapiens (Human)
Description:Recombinant human DHFR.
Residue:187
BDBM50294210
NameBDBM50294210
Synonyms:1-(1-butylphthalazin-2(1H)-yl)-3-(5-((2,4-diaminopyrimidin-5-yl)methyl)-2,3-dimethoxyphenyl)prop-2-en-1-one | CHEMBL562228
TypeSmall organic molecule
Emp. Form.C28H32N6O3
Mol. Mass.500.5921
SMILESCCCCC1N(N=Cc2ccccc12)C(=O)\C=C\c1cc(Cc2cnc(N)nc2N)cc(OC)c1OC