Reaction Details
TargetEukaryotic translation initiation factor 4E
LigandBDBM50294222
Substrate/Competitorn/a
Meas. Tech.ChEMBL_574909 (CHEMBL1023606)
IC50 8000±n/a nM
Citation Kowalska, JLukaszewicz, MZuberek, JZiemniak, MDarzynkiewicz, EJemielity, J Phosphorothioate analogs of m7GTP are enzymatically stable inhibitors of cap-dependent translation. Bioorg Med Chem Lett19:1921-5 (2009) 
 
Eukaryotic translation initiation factor 4E
Name:Eukaryotic translation initiation factor 4E
Type:PROTEIN
Mol. Mass.:25047.40
Organism:Oryctolagus cuniculus
Description:ChEMBL_1511842
Residue:217
BDBM50294222
NameBDBM50294222
Synonyms:((2R,3S,4R,5R)-5-(2-amino-7-methyl-6-oxido-9H-purin-1-ium-9-yl)-3,4-dihydroxytetrahydrofuran-2-yl)methyl triphosphate | CHEMBL550695
TypeSmall organic molecule
Emp. Form.C11H14N5O14P3
Mol. Mass.533.1774
SMILESC[n+]1cn(C2OC(COP([O-])(=O)OP([O-])(=O)OP([O-])([O-])=O)C(O)C2O)c2nc(N)[n-]c(=O)c12