Reaction Details
TargetDNA (cytosine-5)-methyltransferase 3B
LigandBDBM50009672
Substrate/Competitorn/a
Meas. Tech.ChEMBL_575566 (CHEMBL1036409)
IC50 300±n/a nM
Citation Saavedra, OMIsakovic, LLlewellyn, DBZhan, LBernstein, NClaridge, SRaeppel, FVaisburg, AElowe, NPetschner, AJRahil, JBeaulieu, NMacLeod, ARDelorme, DBesterman, JMWahhab, A SAR around (l)-S-adenosyl-l-homocysteine, an inhibitor of human DNA methyltransferase (DNMT) enzymes. Bioorg Med Chem Lett19:2747-51 (2009) 
 
DNA (cytosine-5)-methyltransferase 3B
Name:DNA (cytosine-5)-methyltransferase 3B
Type:PROTEIN
Mol. Mass.:95771.12
Organism:Homo sapiens (Human)
Description:ChEMBL_1473708
Residue:853
BDBM50009672
NameBDBM50009672
Synonyms:AdoHcy S-(5'-adenosyl)-L-homocysteine S-[1-(adenin-9-yl)-1,5-dideoxy-beta-D-ribofuranos-5-yl]-L-homocysteine SAH US9175331, 1 | US9333217, S-Adenosyl-L-homocysteine (SAH)
TypeSmall organic molecule
Emp. Form.C14H20N6O5S
Mol. Mass.384.411
SMILESN[C@@H](CCSC[C@H]1O[C@H]([C@H](O)[C@@H]1O)n1cnc2c(N)ncnc12)C(O)=O